latest git repo

classic Classic list List threaded Threaded
4 messages Options
Reply | Threaded
Open this post in threaded view
|

latest git repo

Casey Cichon
-----BEGIN PGP SIGNED MESSAGE-----
Hash: SHA256

I am getting the following error while trying to compile trunk.

./src/core-utils/.libs/libgnc-core-utils.so
../../../src/gnc-module/.libs/libgnc-module.so
../../../src/libqof/qof/.libs/libgnc-qof.so /usr/lib/libglade-2.0.so
/usr/lib/libxml2.so /usr/lib/libgconf-2.so /usr/lib/libguile.so
/usr/lib/libgmp.so -lcrypt /usr/lib/libltdl.so
/usr/lib/libgtk-x11-2.0.so /usr/lib/libgdk-x11-2.0.so
/usr/lib/libatk-1.0.so /usr/lib/libpangoft2-1.0.so
/usr/lib/libgdk_pixbuf-2.0.so /usr/lib/libpangocairo-1.0.so
/usr/lib/libgio-2.0.so /usr/lib/libcairo.so /usr/lib/libpango-1.0.so
/usr/lib/libfreetype.so -lfontconfig /usr/lib/libgthread-2.0.so -lrt
/usr/lib/libgobject-2.0.so /usr/lib/libgmodule-2.0.so
/usr/lib/libglib-2.0.so -lpthread -lm  -Wl,-Bsymbolic-functions -pthread
- -Wl,--export-dynamic   -pthread -Wl,-soname -Wl,libgncmod-ledger-core.so
- -o .libs/libgncmod-ledger-core.so
libtool: link: ( cd ".libs" && rm -f "libgncmod-ledger-core.la" && ln -s
"../libgncmod-ledger-core.la" "libgncmod-ledger-core.la" )
make[5]: Leaving directory
`/home/casey/Downloads/gnucash/src/register/ledger-core'
Making all in test
make[5]: Entering directory
`/home/casey/Downloads/gnucash/src/register/ledger-core/test'
make[5]: Nothing to be done for `all'.
make[5]: Leaving directory
`/home/casey/Downloads/gnucash/src/register/ledger-core/test'
make[4]: Leaving directory
`/home/casey/Downloads/gnucash/src/register/ledger-core'
make[4]: Entering directory `/home/casey/Downloads/gnucash/src/register'
make[4]: Nothing to be done for `all-am'.
make[4]: Leaving directory `/home/casey/Downloads/gnucash/src/register'
make[3]: Leaving directory `/home/casey/Downloads/gnucash/src/register'
Making all in gnome
make[3]: Entering directory `/home/casey/Downloads/gnucash/src/gnome'
Making all in glade
make[4]: Entering directory `/home/casey/Downloads/gnucash/src/gnome/glade'
make[4]: *** No rule to make target `account.glade', needed by
`all-am'.  Stop.
make[4]: Leaving directory `/home/casey/Downloads/gnucash/src/gnome/glade'
make[3]: *** [all-recursive] Error 1
make[3]: Leaving directory `/home/casey/Downloads/gnucash/src/gnome'
make[2]: *** [all-recursive] Error 1
make[2]: Leaving directory `/home/casey/Downloads/gnucash/src'
make[1]: *** [all-recursive] Error 1
make[1]: Leaving directory `/home/casey/Downloads/gnucash'
make: *** [all] Error 2
casey@wizkid2:~/Downloads/gnucash$ git
pull                                     Already up-to-date.
casey@wizkid2:~/Downloads/gnucash$

I love gnucash and try to keep up to date off of trunk to help test.

Casey

-----BEGIN PGP SIGNATURE-----
Version: PGP Desktop 9.9.1 (Build 352)
Charset: ISO-8859-1

wsBVAwUBTdqwZCQJUa/H/sQUAQhUrgf9GTg4HHw7WMklQMdFJ6r23+2kLYmiZ9xg
gkP7uDs8BOLkRIDUhbJXMYULMUxa7/yNnU37l1o5CXBlfZDww4CpOP4g+6/8Phup
5/+k6odRZHQOVqPk7RuyjWzkHQ70jvm49z8lw5V2HQSF3kEjZVeegW/sRInLtfYL
YqORYlEeglvgaBjdAGLs1NwVb8xGMRilOe1ZWIAhyXKIXhqmmY/7+j1KLBpRXKGg
dCLshps9felPKM0PuBhUFv7+XtoIwK+ef5kVKzkAzgoiQnvwFxRFlxDDyVJ31pGA
D5LgMz9ory8g/EpYkiLktHHvjkajoAuhIWh/W8y2QUkqefJI4Yz+1g==
=JytN
-----END PGP SIGNATURE-----
_______________________________________________
gnucash-devel mailing list
[hidden email]
https://lists.gnucash.org/mailman/listinfo/gnucash-devel
Reply | Threaded
Open this post in threaded view
|

Re: latest git repo

Christian Stimming-4
Am Montag, 23. Mai 2011 schrieb Casey Cichon:
> Making all in glade
> make[4]: Entering directory `/home/casey/Downloads/gnucash/src/gnome/glade'
> make[4]: *** No rule to make target `account.glade', needed by
> `all-am'.  Stop.
> make[4]: Leaving directory `/home/casey/Downloads/gnucash/src/gnome/glade'
> make[3]: *** [all-recursive] Error 1

Fixed in SVN r20676. Sorry for that.

Regards,

Christian
_______________________________________________
gnucash-devel mailing list
[hidden email]
https://lists.gnucash.org/mailman/listinfo/gnucash-devel
Reply | Threaded
Open this post in threaded view
|

Re: latest git repo

Casey Cichon
-----BEGIN PGP SIGNED MESSAGE-----
Hash: SHA256

On 5/23/2011 2:33 PM, Christian Stimming wrote:

> Am Montag, 23. Mai 2011 schrieb Casey Cichon:
>> Making all in glade
>> make[4]: Entering directory `/home/casey/Downloads/gnucash/src/gnome/glade'
>> make[4]: *** No rule to make target `account.glade', needed by
>> `all-am'.  Stop.
>> make[4]: Leaving directory `/home/casey/Downloads/gnucash/src/gnome/glade'
>> make[3]: *** [all-recursive] Error 1
> Fixed in SVN r20676. Sorry for that.
>
> Regards,
>
> Christian
>
That error is now fixed.... now I get a different error..... Probably
another update that I'll wait for git to update :)

libtool: compile: gcc -DHAVE_CONFIG_H -I. -I../..
- -DG_LOG_DOMAIN=\"gnc.gui\" -I../../src/core-utils -I../../src/gnc-module
- -I../../src/engine -I../../src/backend/xml -I../../src/app-utils
- -I../../src -I../../src -I../../lib/libc -I../../src/libqof/qof -pthread
- -I/usr/include/glib-2.0 -I/usr/lib/glib-2.0/include -D_REENTRANT
- -I/usr/include/libglade-2.0 -I/usr/include/gtk-2.0
- -I/usr/include/libxml2 -I/usr/lib/gtk-2.0/include -I/usr/include/atk-1.0
- -I/usr/include/cairo -I/usr/include/pango-1.0 -I/usr/include/pixman-1
- -I/usr/include/freetype2 -I/usr/include/directfb -I/usr/include/libpng12
- -I/usr/include/glib-2.0 -I/usr/lib/glib-2.0/include -D_REENTRANT
- -I/usr/include/gtk-2.0 -I/usr/lib/gtk-2.0/include -I/usr/include/atk-1.0
- -I/usr/include/cairo -I/usr/include/pango-1.0 -I/usr/include/pixman-1
- -I/usr/include/freetype2 -I/usr/include/directfb -I/usr/include/libpng12
- -I/usr/include/glib-2.0 -I/usr/lib/glib-2.0/include -DORBIT2=1 -pthread
- -D_REENTRANT -I/usr/include/libgnomeui-2.0 -I/usr/include/libart-2.0
- -I/usr/include/gconf/2 -I/usr/include/gnome-keyring-1
- -I/usr/include/libgnome-2.0 -I/usr/include/libbonoboui-2.0
- -I/usr/include/libgnomecanvas-2.0 -I/usr/include/gtk-2.0
- -I/usr/include/gnome-vfs-2.0 -I/usr/lib/gnome-vfs-2.0/include
- -I/usr/include/orbit-2.0 -I/usr/include/dbus-1.0
- -I/usr/lib/dbus-1.0/include -I/usr/include/glib-2.0
- -I/usr/lib/glib-2.0/include -I/usr/include/libbonobo-2.0
- -I/usr/include/bonobo-activation-2.0 -I/usr/include/libxml2
- -I/usr/include/pango-1.0 -I/usr/include/gail-1.0
- -I/usr/include/freetype2 -I/usr/include/atk-1.0
- -I/usr/lib/gtk-2.0/include -I/usr/include/cairo -I/usr/include/pixman-1
- -I/usr/include/directfb -I/usr/include/libpng12
- -I/usr/include/gnome-keyring-1 -I/usr/include/glib-2.0
- -I/usr/lib/glib-2.0/include -I../../src/libqof/qof
- -I../../src/libqof/qof -D_REENTRANT -I/usr/include/libgoffice-0.6
- -I/usr/include/glib-2.0 -I/usr/lib/glib-2.0/include
- -I/usr/include/libgsf-1 -I/usr/include/libxml2 -I/usr/include/gtk-2.0
- -I/usr/include/libglade-2.0 -I/usr/include/libart-2.0
- -I/usr/include/cairo -I/usr/include/pango-1.0 -I/usr/lib/gtk-2.0/include
- -I/usr/include/atk-1.0 -I/usr/include/pixman-1 -I/usr/include/freetype2
- -I/usr/include/directfb -I/usr/include/libpng12 -Werror
- -Wdeclaration-after-statement -g -O2 -Wall -Wunused -Wmissing-prototypes
- -Wmissing-declarations -Wno-unused -MT gnc-main-window.lo -MD -MP -MF
.deps/gnc-main-window.Tpo -c gnc-main-window.c -fPIC -DPIC -o
.libs/gnc-main-window.o
cc1: warnings being treated as errors
gnc-main-window.c: In function ‘gnc_main_window_new’:
gnc-main-window.c:2361: error: implicit declaration of function
‘gnc_main_window_update_allmenu_items’
make[4]: *** [gnc-main-window.lo] Error 1
make[4]: Leaving directory `/home/casey/Downloads/gnucash/src/gnome-utils'
make[3]: *** [all-recursive] Error 1
make[3]: Leaving directory `/home/casey/Downloads/gnucash/src/gnome-utils'
make[2]: *** [all-recursive] Error 1
make[2]: Leaving directory `/home/casey/Downloads/gnucash/src'
make[1]: *** [all-recursive] Error 1
make[1]: Leaving directory `/home/casey/Downloads/gnucash'
make: *** [all] Error 2
casey@wizkid2:~/Downloads/gnucash$

-----BEGIN PGP SIGNATURE-----
Version: PGP Desktop 9.9.1 (Build 352)
Charset: windows-1252

wsBVAwUBTdq7HyQJUa/H/sQUAQhCewf/UdTDFXX3Mp/VJ5eN0+DVyHntb5ta18+l
q6uFTkfM7cS+/ElhzQNBkWRZygnjFv9m2BEaCpAycw/zG3kJOA3+zmZuZZNYemIP
KTr2i/jCDv731g+d5BhUxSCwLV+S+qW3AoHkUd6HwxXx5VNEFx6iC9zEMCDK09MW
QZ5pZEWyDeW5x6SaE/kJKHcL7cuBznD/lesXv5tLymutBX7q4lqzI30j4/qe36PY
JKpz0AUUAoXbP7Rgo8tjSz8hapWxqrcH42NoWygPMK8vHEqtXMAdH3I96+gZUruY
VyXUAYCWFuEbUioyjmzUbjL3O8LOvS/uponnssEc5rHU8UH8g2JuOQ==
=ACQ4
-----END PGP SIGNATURE-----
_______________________________________________
gnucash-devel mailing list
[hidden email]
https://lists.gnucash.org/mailman/listinfo/gnucash-devel
Reply | Threaded
Open this post in threaded view
|

Re: latest git repo

John Ralls-2

On May 23, 2011, at 12:53 PM, Casey Cichon wrote:

> -----BEGIN PGP SIGNED MESSAGE-----
> Hash: SHA256
>
> On 5/23/2011 2:33 PM, Christian Stimming wrote:
>> Am Montag, 23. Mai 2011 schrieb Casey Cichon:
>>> Making all in glade
>>> make[4]: Entering directory `/home/casey/Downloads/gnucash/src/gnome/glade'
>>> make[4]: *** No rule to make target `account.glade', needed by
>>> `all-am'.  Stop.
>>> make[4]: Leaving directory `/home/casey/Downloads/gnucash/src/gnome/glade'
>>> make[3]: *** [all-recursive] Error 1
>> Fixed in SVN r20676. Sorry for that.
>>
>> Regards,
>>
>> Christian
>>
> That error is now fixed.... now I get a different error..... Probably
> another update that I'll wait for git to update :)
>
> gnc-main-window.c: In function ‘gnc_main_window_new’:
> gnc-main-window.c:2361: error: implicit declaration of function
> ‘gnc_main_window_update_allmenu_items’

That one's my fault. I had some leakage from a feature branch into trunk. It's reverted in SVN, should be fixed in the 4PM PDT update (usually finishes around 4:20).

Regards,
John Ralls


_______________________________________________
gnucash-devel mailing list
[hidden email]
https://lists.gnucash.org/mailman/listinfo/gnucash-devel