Failures building r 13539

classic Classic list List threaded Threaded
3 messages Options
Reply | Threaded
Open this post in threaded view
|

Failures building r 13539

Tor Harald Thorland
Hi,

I did build successfully 2 days ago, but today with 13539, I'll get one
error, and I can also spot autogen complaining about Potfiles.in
Any help on this one? I cant find this goffice-config.h ... in svn, I've
looked in lib/gofficexxx/goffice/

Thanks
THT

config.status: executing depfiles commands
config.status: executing intltool commands
config.status: executing default-1 commands
config.status: executing po/stamp-it commands
sed: can't read ./po/POTFILES.in: No such file or directory

  Options detected/selected
  -------------------------
  gnucash version ...... : 1.9.2
  Build for host ....... : i686-pc-linux-gnu
  Extra Warnings ....... :  -Werror -Wdeclaration-after-statement
-Wno-pointer-sign -D_FORTIFY_SOURCE=2
  CPPFLAGS ............. :
  CFLAGS ............... : -g -O2 -g -Wall -Wunused -Wmissing-prototypes
-Wmissing-declarations   -Werror -Wdeclaration-after-statement
-Wno-pointer-sign -D_FORTIFY_SOURCE=2
  LDFLAGS .............. :  -g
  prefix.................: /opt/gnucash-1.9
  Native libgsf..........: yes
  Native goffice.........: no
  QOF support ...........: internal
  QOF location ..........: internal
  QOF library dir .......: /opt/gnucash-1.9/lib
  QOF backend config ....: /opt/gnucash-1.9/share/xml/qsf



make[7]: Entering directory
`/home/tortho/source/gnucash/lib/goffice-0.0.4/goffice/utils'
(echo '/* This file has been automatically generated.  Do not edit. */' && \
        echo '#include <goffice/goffice-config.h>' && \
        echo '#include "go-marshalers.h"' && \
        glib-genmarshal --prefix=go_ --body go-marshalers.list )
 >go-marshalers.c
if /bin/sh ../../../../libtool --tag=CC --mode=compile gcc
-DHAVE_CONFIG_H -I. -I. -I../../../.. -I../../../.. -I../../../..
-I../../../..  -I../../../../lib/libgsf-1.12.3
-I../../../../lib/goffice-0.0.4 -I../../../../lib/goffice-0.0.4
-DORBIT2=1 -pthread -I/usr/include/glib-2.0 -I/usr/lib/glib-2.0/include
-I/usr/include/libxml2 -I/usr/include/pango-1.0 -I/usr/include/freetype2
-I/usr/include/gtk-2.0 -I/usr/lib/gtk-2.0/include -I/usr/include/atk-1.0
-I/usr/include/cairo -I/usr/include/libglade-2.0
-I/usr/include/libgnomeprint-2.2 -I/usr/include/libart-2.0
-I/usr/include/gconf/2 -I/usr/include/orbit-2.0
-I/usr/include/libgnomeui-2.0 -I/usr/include/libgnome-2.0
-I/usr/include/libgnomecanvas-2.0 -I/usr/include/libbonoboui-2.0
-I/usr/include/gnome-vfs-2.0 -I/usr/lib/gnome-vfs-2.0/include
-I/usr/include/gnome-keyring-1 -I/usr/include/libbonobo-2.0
-I/usr/include/bonobo-activation-2.0 -I/usr/include/libgsf-1
-I/usr/include/gnome-vfs-module-2.0     -g -O2 -g -Wall -Wunused
-Wmissing-prototypes -Wmissing-declarations   -Werror
-Wdeclaration-after-statement -Wno-pointer-sign -D_FORTIFY_SOURCE=2 -MT
go-marshalers.lo -MD -MP -MF ".deps/go-marshalers.Tpo" -c -o
go-marshalers.lo go-marshalers.c; \
        then mv -f ".deps/go-marshalers.Tpo" ".deps/go-marshalers.Plo";
else rm -f ".deps/go-marshalers.Tpo"; exit 1; fi
mkdir .libs
 gcc -DHAVE_CONFIG_H -I. -I. -I../../../.. -I../../../.. -I../../../..
-I../../../.. -I../../../../lib/libgsf-1.12.3
-I../../../../lib/goffice-0.0.4 -I../../../../lib/goffice-0.0.4
-DORBIT2=1 -pthread -I/usr/include/glib-2.0 -I/usr/lib/glib-2.0/include
-I/usr/include/libxml2 -I/usr/include/pango-1.0 -I/usr/include/freetype2
-I/usr/include/gtk-2.0 -I/usr/lib/gtk-2.0/include -I/usr/include/atk-1.0
-I/usr/include/cairo -I/usr/include/libglade-2.0
-I/usr/include/libgnomeprint-2.2 -I/usr/include/libart-2.0
-I/usr/include/gconf/2 -I/usr/include/orbit-2.0
-I/usr/include/libgnomeui-2.0 -I/usr/include/libgnome-2.0
-I/usr/include/libgnomecanvas-2.0 -I/usr/include/libbonoboui-2.0
-I/usr/include/gnome-vfs-2.0 -I/usr/lib/gnome-vfs-2.0/include
-I/usr/include/gnome-keyring-1 -I/usr/include/libbonobo-2.0
-I/usr/include/bonobo-activation-2.0 -I/usr/include/libgsf-1
-I/usr/include/gnome-vfs-module-2.0 -g -O2 -g -Wall -Wunused
-Wmissing-prototypes -Wmissing-declarations -Werror
-Wdeclaration-after-statement -Wno-pointer-sign -D_FORTIFY_SOURCE=2 -MT
go-marshalers.lo -MD -MP -MF .deps/go-marshalers.Tpo -c go-marshalers.c  
-fPIC -DPIC -o .libs/go-marshalers.o
go-marshalers.c:2:36: error: goffice/goffice-config.h: No such file or
directory
make[7]: *** [go-marshalers.lo] Error 1
make[7]: Leaving directory
`/home/tortho/source/gnucash/lib/goffice-0.0.4/goffice/utils'
make[6]: *** [all] Error 2
make[6]: Leaving directory
`/home/tortho/source/gnucash/lib/goffice-0.0.4/goffice/utils'
make[5]: *** [all-recursive] Error 1
make[5]: Leaving directory
`/home/tortho/source/gnucash/lib/goffice-0.0.4/goffice'
make[4]: *** [all] Error 2
make[4]: Leaving directory
`/home/tortho/source/gnucash/lib/goffice-0.0.4/goffice'
make[3]: *** [all-recursive] Error 1
make[3]: Leaving directory `/home/tortho/source/gnucash/lib/goffice-0.0.4'
make[2]: *** [all-recursive] Error 1
make[2]: Leaving directory `/home/tortho/source/gnucash/lib'
make[1]: *** [all-recursive] Error 1
make[1]: Leaving directory `/home/tortho/source/gnucash'
make: *** [all] Error 2

_______________________________________________
gnucash-devel mailing list
[hidden email]
https://lists.gnucash.org/mailman/listinfo/gnucash-devel
Reply | Threaded
Open this post in threaded view
|

Re: Failures building r 13539

Josh Sled
On Wed, 2006-03-08 at 15:34 +0000, Tor Harald Thorland wrote:
> I did build successfully 2 days ago, but today with 13539, I'll get one
> error, and I can also spot autogen complaining about Potfiles.in
> Any help on this one? I cant find this goffice-config.h ... in svn, I've
> looked in lib/gofficexxx/goffice/

What's your update/rebuild procedure?  From the point 2 days ago, what
commands did you run in order to update and re-build r13539?

--
...jsled
http://asynchronous.org/ - `a=jsled; b=asynchronous.org; echo ${a}@${b}`
_______________________________________________
gnucash-devel mailing list
[hidden email]
https://lists.gnucash.org/mailman/listinfo/gnucash-devel
Reply | Threaded
Open this post in threaded view
|

Re: Failures building r 13539

David Hampton-2
In reply to this post by Tor Harald Thorland
On Wed, 2006-03-08 at 15:34 +0000, Tor Harald Thorland wrote:
> Hi,
>
> I did build successfully 2 days ago, but today with 13539, I'll get one
> error, and I can also spot autogen complaining about Potfiles.in
> Any help on this one? I cant find this goffice-config.h ... in svn, I've
> looked in lib/gofficexxx/goffice/

Remove the '.links' file in the top level gnucash directory and compile
again.

David


_______________________________________________
gnucash-devel mailing list
[hidden email]
https://lists.gnucash.org/mailman/listinfo/gnucash-devel